Activating Boost config

6 jobs for master in 4 minutes and 50 seconds (queued for 4 seconds)
Status Name Job ID Coverage
  Build
passed centos_build #16192
centos

00:03:59

failed mac_build #16193
mac

00:02:32

passed ubuntu_build #16194
ubuntu

00:04:48

 
  Test
skipped centos_run #16195
centos
skipped mac_run #16196
mac
skipped ubuntu_run #16197
ubuntu
 
Name Stage Failure
failed
mac_build Build
1 error generated.
make[3]: *** [src/CMakeFiles/mem_map.dir/SparseGridGpu/tests/SparseGridGpu_tests.cu.o] Error 1
make[2]: *** [src/CMakeFiles/mem_map.dir/all] Error 2
make[1]: *** [all] Error 2
make: *** [all] Error 2
% Total % Received % Xferd Average Speed Time Time Time Current
Dload Upload Total Spent Left Speed
0 0 0 0 0 0 0 0 --:--:-- --:--:-- --:--:-- 0 100 211 0 13 100 198 68 1042 --:--:-- --:--:-- --:--:-- 1110
invalid_token
Cleaning up file based variables
ERROR: Job failed: exit status 1