Fixing CUDA compilation

6 jobs for master in 5 minutes and 50 seconds (queued for 3 seconds)
Status Name Job ID Coverage
  Build
failed centos_build #17334
centos

00:03:26

failed mac_build #17335
mac

00:05:50

failed ubuntu_build #17336
ubuntu

00:04:02

 
  Test
skipped centos_run #17337
centos
skipped mac_run #17338
mac
skipped ubuntu_run #17339
ubuntu
 
Name Stage Failure
failed
centos_build Build
make[2]: *** [CMakeFiles/Makefile2:213: src/CMakeFiles/mem_map.dir/all] Error 2
make[2]: Leaving directory '/home/gitlab-runner/builds/80f82b32/0/mosaic/software/parallel-computing/openfpm/openfpm_data/openfpm_data/build'
make[1]: *** [Makefile:136: all] Error 2
make[1]: Leaving directory '/home/gitlab-runner/builds/80f82b32/0/mosaic/software/parallel-computing/openfpm/openfpm_data/openfpm_data/build'
make: *** [Makefile:2: all] Error 2
% Total % Received % Xferd Average Speed Time Time Time Current
Dload Upload Total Spent Left Speed
0 0 0 0 0 0 0 0 --:--:-- --:--:-- --:--:-- 0 100 214 0 13 100 201 41 638 --:--:-- --:--:-- --:--:-- 640
invalid_token
Cleaning up file based variables
ERROR: Job failed: exit status 1
failed
ubuntu_build Build
make[2]: *** [CMakeFiles/Makefile2:237: src/CMakeFiles/mem_map.dir/all] Error 2
make[2]: Leaving directory '/home/gitlab-runner/builds/3ab189aa/1/mosaic/software/parallel-computing/openfpm/openfpm_data/openfpm_data/build'
make[1]: *** [Makefile:149: all] Error 2
make[1]: Leaving directory '/home/gitlab-runner/builds/3ab189aa/1/mosaic/software/parallel-computing/openfpm/openfpm_data/openfpm_data/build'
make: *** [Makefile:2: all] Error 2
% Total % Received % Xferd Average Speed Time Time Time Current
Dload Upload Total Spent Left Speed
0 0 0 0 0 0 0 0 --:--:-- --:--:-- --:--:-- 0 100 203 0 13 100 190 77 1137 --:--:-- --:--:-- --:--:-- 1208 100 203 0 13 100 190 77 1137 --:--:-- --:--:-- --:--:-- 1208
invalid_token
Cleaning up file based variables
ERROR: Job failed: exit status 1
failed
mac_build Build
6 warnings and 2 errors generated.
make[3]: *** [src/CMakeFiles/mem_map.dir/main.cpp.o] Error 1
make[2]: *** [src/CMakeFiles/mem_map.dir/all] Error 2
make[1]: *** [all] Error 2
make: *** [all] Error 2
% Total % Received % Xferd Average Speed Time Time Time Current
Dload Upload Total Spent Left Speed
0 0 0 0 0 0 0 0 --:--:-- --:--:-- --:--:-- 0 100 211 0 13 100 198 68 1047 --:--:-- --:--:-- --:--:-- 1122
invalid_token
Cleaning up file based variables
ERROR: Job failed: exit status 1