Particle outside of transition

6 jobs for Formal_Interface in 12 minutes and 19 seconds (queued for 7 seconds)
latest
Status Name Job ID Coverage
  Build
failed centos_build #15086
centos

00:05:42

failed mac_build #15087
mac

00:12:18

failed ubuntu_build #15088
ubuntu

00:08:34

 
  Test
skipped centos_run #15089
centos
skipped mac_run #15090
mac
skipped ubuntu_run #15091
ubuntu
 
Name Stage Failure
failed
centos_build Build
make[3]: *** [src/CMakeFiles/pdata.dir/build.make:458: src/pdata] Error 1
make[3]: Leaving directory '/home/gitlab-runner/builds/80f82b32/0/mosaic/software/parallel-computing/openfpm/openfpm_pdata/build'
make[2]: *** [CMakeFiles/Makefile2:564: src/CMakeFiles/pdata.dir/all] Error 2
make[2]: Leaving directory '/home/gitlab-runner/builds/80f82b32/0/mosaic/software/parallel-computing/openfpm/openfpm_pdata/build'
make[1]: *** [Makefile:166: all] Error 2
make[1]: Leaving directory '/home/gitlab-runner/builds/80f82b32/0/mosaic/software/parallel-computing/openfpm/openfpm_pdata/build'
make: *** [Makefile:2: all] Error 2
Fail make install
Cleaning up file based variables
ERROR: Job failed: exit status 1
failed
ubuntu_build Build
make[3]: *** [src/CMakeFiles/pdata.dir/build.make:563: src/pdata] Error 1
make[3]: Leaving directory '/home/gitlab-runner/builds/3ab189aa/0/mosaic/software/parallel-computing/openfpm/openfpm_pdata/build'
make[2]: *** [CMakeFiles/Makefile2:620: src/CMakeFiles/pdata.dir/all] Error 2
make[2]: Leaving directory '/home/gitlab-runner/builds/3ab189aa/0/mosaic/software/parallel-computing/openfpm/openfpm_pdata/build'
make[1]: *** [Makefile:182: all] Error 2
make[1]: Leaving directory '/home/gitlab-runner/builds/3ab189aa/0/mosaic/software/parallel-computing/openfpm/openfpm_pdata/build'
make: *** [Makefile:2: all] Error 2
Fail make install
Cleaning up file based variables
ERROR: Job failed: exit status 1
failed
mac_build Build
    CMakeFiles/pdata.dir/__/experiments/ex1.cpp.o
ld: 1 duplicate symbol for architecture x86_64
clang: error: linker command failed with exit code 1 (use -v to see invocation)
make[3]: *** [src/pdata] Error 1
make[2]: *** [src/CMakeFiles/pdata.dir/all] Error 2
make[1]: *** [all] Error 2
make: *** [all] Error 2
Fail make install
Cleaning up file based variables
ERROR: Job failed: exit status 1