working benchmark ellipse to circle surface tension pcp+sph

6 jobs for cp_interpolation in 7 minutes and 17 seconds (queued for 4 seconds)
Status Name Job ID Coverage
  Build
failed centos_build #19464
centos

00:04:32

failed mac_build #19465
mac

00:07:17

failed ubuntu_build #19466
ubuntu

00:05:41

 
  Test
skipped centos_run #19467
centos
skipped mac_run #19468
mac
skipped ubuntu_run #19469
ubuntu
 
Name Stage Failure
failed
centos_build Build
/home/gitlab-runner/openfpm_dependencies/openfpm_pdata/cp_interpolation/MPI/bin/mpic++  -fopenmp -O3 CMakeFiles/pdata.dir/initialize/initialize_wrapper_cpu.cpp.o CMakeFiles/pdata.dir/main.cpp.o CMakeFiles/pdata.dir/Amr/grid_dist_amr_unit_tests.cpp.o CMakeFiles/pdata.dir/Amr/tests/amr_base_unit_tests.cpp.o CMakeFiles/pdata.dir/Debug/debug_test.cpp.o CMakeFiles/pdata.dir/Grid/tests/grid_dist_id_HDF5_chckpnt_restart_test.cpp.o CMakeFiles/pdata.dir/Grid/tests/grid_dist_id_unit_test.cpp.o CMakeFiles/pdata.dir/Grid/tests/sgrid_dist_id_unit_tests.cpp.o CMakeFiles/pdata.dir/Grid/tests/grid_dist_id_dlb_unit_test.cpp.o CMakeFiles/pdata.dir/Grid/tests/staggered_grid_dist_unit_test.cpp.o CMakeFiles/pdata.dir/Vector/tests/vector_dist_cell_list_tests.cpp.o CMakeFiles/pdata.dir/Vector/tests/vector_dist_complex_prp_unit_test.cpp.o CMakeFiles/pdata.dir/Vector/tests/vector_dist_HDF5_chckpnt_restart_test.cpp.o CMakeFiles/pdata.dir/Vector/tests/vector_dist_MP_unit_tests.cpp.o CMakeFiles/pdata.dir/Vector/tests/vector_dist_NN_tests.cpp.o CMakeFiles/pdata.dir/Vector/tests/vector_dist_unit_test.cpp.o CMakeFiles/pdata.dir/pdata_performance.cpp.o CMakeFiles/pdata.dir/Decomposition/tests/CartDecomposition_unit_test.cpp.o CMakeFiles/pdata.dir/Decomposition/tests/shift_vect_converter_tests.cpp.o CMakeFiles/pdata.dir/Vector/performance/vector_dist_performance_util.cpp.o CMakeFiles/pdata.dir/lib/pdata.cpp.o CMakeFiles/pdata.dir/test_multiple_o.cpp.o -o pdata  /home/gitlab-runner/openfpm_dependencies/openfpm_pdata/cp_interpolation/BOOST/lib/libboost_unit_test_framework.so /home/gitlab-runner/openfpm_dependencies/openfpm_pdata/cp_interpolation/BOOST/lib/libboost_iostreams.so /home/gitlab-runner/openfpm_dependencies/openfpm_pdata/cp_interpolation/BOOST/lib/libboost_program_options.so /home/gitlab-runner/openfpm_dependencies/openfpm_pdata/cp_interpolation/BOOST/lib/libboost_system.so /home/gitlab-runner/openfpm_dependencies/openfpm_pdata/cp_interpolation/BOOST/lib/libboost_filesystem.so /home/gitlab-runner/openfpm_dependencies/openfpm_pdata/cp_interpolation/BOOST/lib/libboost_fiber.so /home/gitlab-runner/openfpm_dependencies/openfpm_pdata/cp_interpolation/BOOST/lib/libboost_context.so /home/gitlab-runner/openfpm_dependencies/openfpm_pdata/cp_interpolation/BOOST/lib/libboost_regex.so /home/gitlab-runner/openfpm_dependencies/openfpm_pdata/cp_interpolation/PARMETIS/lib/libparmetis.a /home/gitlab-runner/openfpm_dependencies/openfpm_pdata/cp_interpolation/METIS/lib/libmetis.so -L/home/gitlab-runner/openfpm_dependencies/openfpm_pdata/cp_interpolation/METIS/lib -lmetis /home/gitlab-runner/openfpm_dependencies/openfpm_pdata/cp_interpolation/HDF5/lib/libhdf5.so /usr/lib64/libz.so /usr/lib64/libdl.so /usr/lib64/libm.so -L/home/gitlab-runner/openfpm_dependencies/openfpm_pdata/cp_interpolation/LIBHILBERT/lib -llibhilbert /home/gitlab-runner/openfpm_dependencies/openfpm_pdata/cp_interpolation/PETSC/lib/libpetsc.so /home/gitlab-runner/openfpm_dependencies/openfpm_pdata/cp_interpolation/VCDEVEL/lib/libVc.a ../openfpm_io/openfpm_vcluster/src/libvcluster.a ../openfpm_io/openfpm_vcluster/openfpm_data/openfpm_devices/src/libofpmmemory.a /home/gitlab-runner/openfpm_dependencies/openfpm_pdata/cp_interpolation/PETSC/lib/libpetsc.so -lm -lc -lrt /home/gitlab-runner/openfpm_dependencies/openfpm_pdata/cp_interpolation/BOOST/lib/libboost_unit_test_framework.so /home/gitlab-runner/openfpm_dependencies/openfpm_pdata/cp_interpolation/BOOST/lib/libboost_iostreams.so /home/gitlab-runner/openfpm_dependencies/openfpm_pdata/cp_interpolation/BOOST/lib/libboost_program_options.so /home/gitlab-runner/openfpm_dependencies/openfpm_pdata/cp_interpolation/BOOST/lib/libboost_fiber.so /home/gitlab-runner/openfpm_dependencies/openfpm_pdata/cp_interpolation/BOOST/lib/libboost_context.so /home/gitlab-runner/openfpm_dependencies/openfpm_pdata/cp_interpolation/BOOST/lib/libboost_regex.so 
make[3]: Leaving directory '/home/gitlab-runner/builds/80f82b32/0/mosaic/software/parallel-computing/openfpm/openfpm_pdata/build'
[ 73%] Built target pdata
make[2]: Leaving directory '/home/gitlab-runner/builds/80f82b32/0/mosaic/software/parallel-computing/openfpm/openfpm_pdata/build'
make[1]: *** [Makefile:166: all] Error 2
make[1]: Leaving directory '/home/gitlab-runner/builds/80f82b32/0/mosaic/software/parallel-computing/openfpm/openfpm_pdata/build'
make: *** [Makefile:2: all] Error 2
Fail make install
Cleaning up file based variables
ERROR: Job failed: exit status 1
failed
mac_build Build
cd /Users/admin/builds/qhsSKt21/0/mosaic/software/parallel-computing/openfpm/openfpm_pdata/build/src && /Users/admin/openfpm_dependencies/openfpm_pdata/cp_interpolation/MPI/bin/mpic++ -DBOOST_ALL_NO_LIB -DBOOST_CONTEXT_DYN_LINK -DBOOST_FIBER_DYN_LINK -DBOOST_FILESYSTEM_DYN_LINK -DBOOST_IOSTREAMS_DYN_LINK -DBOOST_PROGRAM_OPTIONS_DYN_LINK -DBOOST_SYSTEM_DYN_LINK -DBOOST_UNIT_TEST_FRAMEWORK_DYN_LINK -DSCAN_WITH_CUB -Dopenmpi -I/Users/admin/openfpm_dependencies/openfpm_pdata/cp_interpolation/PARMETIS/include -I/Users/admin/openfpm_dependencies/openfpm_pdata/cp_interpolation/METIS/include -I/Users/admin/openfpm_dependencies/openfpm_pdata/cp_interpolation/HDF5/include -I/Users/admin/builds/qhsSKt21/0/mosaic/software/parallel-computing/openfpm/openfpm_pdata/src -I/Users/admin/builds/qhsSKt21/0/mosaic/software/parallel-computing/openfpm/openfpm_pdata/src/../openfpm_devices/src -I/Users/admin/builds/qhsSKt21/0/mosaic/software/parallel-computing/openfpm/openfpm_pdata/src/../openfpm_vcluster/src -I/Users/admin/builds/qhsSKt21/0/mosaic/software/parallel-computing/openfpm/openfpm_pdata/src/../openfpm_data/src -I/Users/admin/builds/qhsSKt21/0/mosaic/software/parallel-computing/openfpm/openfpm_pdata/src/../openfpm_io/src -I/Users/admin/builds/qhsSKt21/0/mosaic/software/parallel-computing/openfpm/openfpm_pdata/src/config -I/Users/admin/openfpm_dependencies/openfpm_pdata/cp_interpolation/PETSC/include -I/Users/admin/openfpm_dependencies/openfpm_pdata/cp_interpolation/LIBHILBERT/include -I/include -I/Users/admin/openfpm_dependencies/openfpm_pdata/cp_interpolation/VCDEVEL/include -isystem /usr/local/include -O3 -isysroot /Library/Developer/CommandLineTools/SDKs/MacOSX11.3.sdk -Wno-undefined-var-template -Wno-macro-redefined -std=gnu++14 -MD -MT src/CMakeFiles/pdata.dir/test_multiple_o.cpp.o -MF CMakeFiles/pdata.dir/test_multiple_o.cpp.o.d -o CMakeFiles/pdata.dir/test_multiple_o.cpp.o -c /Users/admin/builds/qhsSKt21/0/mosaic/software/parallel-computing/openfpm/openfpm_pdata/src/test_multiple_o.cpp
[ 73%] Linking CXX executable pdata
cd /Users/admin/builds/qhsSKt21/0/mosaic/software/parallel-computing/openfpm/openfpm_pdata/build/src && /Users/admin/openfpm_dependencies/openfpm_pdata/cp_interpolation/CMAKE/bin/cmake -E cmake_link_script CMakeFiles/pdata.dir/link.txt --verbose=1
/Users/admin/openfpm_dependencies/openfpm_pdata/cp_interpolation/MPI/bin/mpic++ -O3 -isysroot /Library/Developer/CommandLineTools/SDKs/MacOSX11.3.sdk -Wl,-search_paths_first -Wl,-headerpad_max_install_names CMakeFiles/pdata.dir/initialize/initialize_wrapper_cpu.cpp.o CMakeFiles/pdata.dir/main.cpp.o CMakeFiles/pdata.dir/Amr/grid_dist_amr_unit_tests.cpp.o CMakeFiles/pdata.dir/Amr/tests/amr_base_unit_tests.cpp.o CMakeFiles/pdata.dir/Debug/debug_test.cpp.o CMakeFiles/pdata.dir/Grid/tests/grid_dist_id_HDF5_chckpnt_restart_test.cpp.o CMakeFiles/pdata.dir/Grid/tests/grid_dist_id_unit_test.cpp.o CMakeFiles/pdata.dir/Grid/tests/sgrid_dist_id_unit_tests.cpp.o CMakeFiles/pdata.dir/Grid/tests/grid_dist_id_dlb_unit_test.cpp.o CMakeFiles/pdata.dir/Grid/tests/staggered_grid_dist_unit_test.cpp.o CMakeFiles/pdata.dir/Vector/tests/vector_dist_cell_list_tests.cpp.o CMakeFiles/pdata.dir/Vector/tests/vector_dist_complex_prp_unit_test.cpp.o CMakeFiles/pdata.dir/Vector/tests/vector_dist_HDF5_chckpnt_restart_test.cpp.o CMakeFiles/pdata.dir/Vector/tests/vector_dist_MP_unit_tests.cpp.o CMakeFiles/pdata.dir/Vector/tests/vector_dist_NN_tests.cpp.o CMakeFiles/pdata.dir/Vector/tests/vector_dist_unit_test.cpp.o CMakeFiles/pdata.dir/pdata_performance.cpp.o CMakeFiles/pdata.dir/Decomposition/tests/CartDecomposition_unit_test.cpp.o CMakeFiles/pdata.dir/Decomposition/tests/shift_vect_converter_tests.cpp.o CMakeFiles/pdata.dir/Vector/performance/vector_dist_performance_util.cpp.o CMakeFiles/pdata.dir/lib/pdata.cpp.o CMakeFiles/pdata.dir/test_multiple_o.cpp.o -o pdata /usr/local/lib/libboost_system-mt.dylib /Users/admin/openfpm_dependencies/openfpm_pdata/cp_interpolation/PARMETIS/lib/libparmetis.a /Users/admin/openfpm_dependencies/openfpm_pdata/cp_interpolation/METIS/lib/libmetis.dylib -L/Users/admin/openfpm_dependencies/openfpm_pdata/cp_interpolation/METIS/lib -lmetis /Users/admin/openfpm_dependencies/openfpm_pdata/cp_interpolation/HDF5/lib/libhdf5.dylib /Library/Developer/CommandLineTools/SDKs/MacOSX11.3.sdk/usr/lib/libz.tbd /Library/Developer/CommandLineTools/SDKs/MacOSX11.3.sdk/usr/lib/libdl.tbd /Library/Developer/CommandLineTools/SDKs/MacOSX11.3.sdk/usr/lib/libm.tbd -L/Users/admin/openfpm_dependencies/openfpm_pdata/cp_interpolation/LIBHILBERT/lib -llibhilbert /Users/admin/openfpm_dependencies/openfpm_pdata/cp_interpolation/PETSC/lib/libpetsc.dylib /Users/admin/openfpm_dependencies/openfpm_pdata/cp_interpolation/VCDEVEL/lib/libVc.a ../openfpm_io/openfpm_vcluster/src/libvcluster.a ../openfpm_io/openfpm_vcluster/openfpm_data/openfpm_devices/src/libofpmmemory.a /Users/admin/openfpm_dependencies/openfpm_pdata/cp_interpolation/PETSC/lib/libpetsc.dylib -lm -lc /usr/local/lib/libboost_unit_test_framework-mt.dylib /usr/local/lib/libboost_iostreams-mt.dylib /usr/local/lib/libboost_program_options-mt.dylib /usr/local/lib/libboost_fiber-mt.dylib /usr/local/lib/libboost_filesystem-mt.dylib /usr/local/lib/libboost_context-mt.dylib
[ 73%] Built target pdata
make[1]: *** [all] Error 2
make: *** [all] Error 2
Fail make install
Cleaning up file based variables
ERROR: Job failed: exit status 1
failed
ubuntu_build Build
/home/gitlab-runner/openfpm_dependencies/openfpm_pdata/cp_interpolation/MPI/bin/mpic++  -fopenmp -O3 CMakeFiles/pdata.dir/initialize/initialize_wrapper_cpu.cpp.o CMakeFiles/pdata.dir/Grid/tests/sgrid_dist_id_gpu_unit_tests.cu.o CMakeFiles/pdata.dir/Vector/cuda/vector_dist_gpu_MP_tests.cu.o CMakeFiles/pdata.dir/Vector/cuda/vector_dist_cuda_func_test.cu.o CMakeFiles/pdata.dir/Decomposition/cuda/decomposition_cuda_tests.cu.o CMakeFiles/pdata.dir/Vector/cuda/vector_dist_gpu_unit_tests.cu.o CMakeFiles/pdata.dir/Decomposition/cuda/Domain_icells_cart_unit_test.cu.o CMakeFiles/pdata.dir/Amr/tests/amr_base_gpu_unit_tests.cu.o CMakeFiles/pdata.dir/Grid/tests/grid_dist_id_unit_test.cu.o CMakeFiles/pdata.dir/main.cpp.o CMakeFiles/pdata.dir/Amr/grid_dist_amr_unit_tests.cpp.o CMakeFiles/pdata.dir/Amr/tests/amr_base_unit_tests.cpp.o CMakeFiles/pdata.dir/Debug/debug_test.cpp.o CMakeFiles/pdata.dir/Grid/tests/grid_dist_id_HDF5_chckpnt_restart_test.cpp.o CMakeFiles/pdata.dir/Grid/tests/grid_dist_id_unit_test.cpp.o CMakeFiles/pdata.dir/Grid/tests/sgrid_dist_id_unit_tests.cpp.o CMakeFiles/pdata.dir/Grid/tests/grid_dist_id_dlb_unit_test.cpp.o CMakeFiles/pdata.dir/Grid/tests/staggered_grid_dist_unit_test.cpp.o CMakeFiles/pdata.dir/Vector/tests/vector_dist_cell_list_tests.cpp.o CMakeFiles/pdata.dir/Vector/tests/vector_dist_complex_prp_unit_test.cpp.o CMakeFiles/pdata.dir/Vector/tests/vector_dist_HDF5_chckpnt_restart_test.cpp.o CMakeFiles/pdata.dir/Vector/tests/vector_dist_MP_unit_tests.cpp.o CMakeFiles/pdata.dir/Vector/tests/vector_dist_NN_tests.cpp.o CMakeFiles/pdata.dir/Vector/tests/vector_dist_unit_test.cpp.o CMakeFiles/pdata.dir/pdata_performance.cpp.o CMakeFiles/pdata.dir/Decomposition/tests/CartDecomposition_unit_test.cpp.o CMakeFiles/pdata.dir/Decomposition/tests/shift_vect_converter_tests.cpp.o CMakeFiles/pdata.dir/Vector/performance/vector_dist_performance_util.cpp.o CMakeFiles/pdata.dir/lib/pdata.cpp.o CMakeFiles/pdata.dir/test_multiple_o.cpp.o -o pdata  /home/gitlab-runner/openfpm_dependencies/openfpm_pdata/cp_interpolation/BOOST/lib/libboost_unit_test_framework.so /home/gitlab-runner/openfpm_dependencies/openfpm_pdata/cp_interpolation/BOOST/lib/libboost_iostreams.so /home/gitlab-runner/openfpm_dependencies/openfpm_pdata/cp_interpolation/BOOST/lib/libboost_program_options.so /home/gitlab-runner/openfpm_dependencies/openfpm_pdata/cp_interpolation/BOOST/lib/libboost_system.so /home/gitlab-runner/openfpm_dependencies/openfpm_pdata/cp_interpolation/BOOST/lib/libboost_filesystem.so /home/gitlab-runner/openfpm_dependencies/openfpm_pdata/cp_interpolation/BOOST/lib/libboost_fiber.so /home/gitlab-runner/openfpm_dependencies/openfpm_pdata/cp_interpolation/BOOST/lib/libboost_context.so /home/gitlab-runner/openfpm_dependencies/openfpm_pdata/cp_interpolation/BOOST/lib/libboost_regex.so /home/gitlab-runner/openfpm_dependencies/openfpm_pdata/cp_interpolation/PARMETIS/lib/libparmetis.a /home/gitlab-runner/openfpm_dependencies/openfpm_pdata/cp_interpolation/METIS/lib/libmetis.so -L/home/gitlab-runner/openfpm_dependencies/openfpm_pdata/cp_interpolation/METIS/lib -lmetis /home/gitlab-runner/openfpm_dependencies/openfpm_pdata/cp_interpolation/HDF5/lib/libhdf5.so /usr/lib/x86_64-linux-gnu/libz.so /usr/lib/x86_64-linux-gnu/libdl.so -lm -L/home/gitlab-runner/openfpm_dependencies/openfpm_pdata/cp_interpolation/LIBHILBERT/lib -llibhilbert /home/gitlab-runner/openfpm_dependencies/openfpm_pdata/cp_interpolation/PETSC/lib/libpetsc.so /home/gitlab-runner/openfpm_dependencies/openfpm_pdata/cp_interpolation/VCDEVEL/lib/libVc.a ../openfpm_io/openfpm_vcluster/src/libvcluster.a ../openfpm_io/openfpm_vcluster/openfpm_data/openfpm_devices/src/libofpmmemory.a /home/gitlab-runner/openfpm_dependencies/openfpm_pdata/cp_interpolation/PETSC/lib/libpetsc.so -lm -lc -lrt /home/gitlab-runner/openfpm_dependencies/openfpm_pdata/cp_interpolation/BOOST/lib/libboost_unit_test_framework.so /home/gitlab-runner/openfpm_dependencies/openfpm_pdata/cp_interpolation/BOOST/lib/libboost_iostreams.so /home/gitlab-runner/openfpm_dependencies/openfpm_pdata/cp_interpolation/BOOST/lib/libboost_program_options.so /home/gitlab-runner/openfpm_dependencies/openfpm_pdata/cp_interpolation/BOOST/lib/libboost_fiber.so /home/gitlab-runner/openfpm_dependencies/openfpm_pdata/cp_interpolation/BOOST/lib/libboost_context.so /home/gitlab-runner/openfpm_dependencies/openfpm_pdata/cp_interpolation/BOOST/lib/libboost_regex.so 
make[3]: Leaving directory '/home/gitlab-runner/builds/3ab189aa/0/mosaic/software/parallel-computing/openfpm/openfpm_pdata/build'
[ 79%] Built target pdata
make[2]: Leaving directory '/home/gitlab-runner/builds/3ab189aa/0/mosaic/software/parallel-computing/openfpm/openfpm_pdata/build'
make[1]: *** [Makefile:182: all] Error 2
make[1]: Leaving directory '/home/gitlab-runner/builds/3ab189aa/0/mosaic/software/parallel-computing/openfpm/openfpm_pdata/build'
make: *** [Makefile:2: all] Error 2
Fail make install
Cleaning up file based variables
ERROR: Job failed: exit status 1