Eliminating autotools and making it work with gitlab

Status Job ID Name Coverage
  Build
failed #1107
centos
centos_build

00:00:02

failed #1108
mac
mac_build

00:00:02

failed #1109
ubuntu
ubuntu_build

00:00:01

 
  Test
skipped #1110
centos
centos_run
skipped #1111
mac
mac_run
skipped #1112
ubuntu
ubuntu_run
 
Name Stage Failure
failed
mac_build Build
CMake Error: The source directory "/Users/jenkins/builds/220b7aaa/0/openfpm/openfpm_data/openfpm_data" does not appear to contain CMakeLists.txt.
Specify --help for usage, or press the help button on the CMake GUI.
/Library/Developer/CommandLineTools/usr/bin/make -C build
make[1]: *** No targets specified and no makefile found. Stop.
make: *** [build] Error 2
% Total % Received % Xferd Average Speed Time Time Time Current
Dload Upload Total Spent Left Speed
0 0 0 0 0 0 0 0 --:--:-- --:--:-- --:--:-- 0 100 180 0 2 100 178 10 970 --:--:-- --:--:-- --:--:-- 972
okERROR: Job failed: exit status 1
failed
centos_build Build
make -C build
make[1]: Entering directory `/home/gitlab-runner/builds/80f82b32/0/openfpm/openfpm_data/openfpm_data/build'
make[1]: *** No targets specified and no makefile found. Stop.
make[1]: Leaving directory `/home/gitlab-runner/builds/80f82b32/0/openfpm/openfpm_data/openfpm_data/build'
make: *** [build] Error 2
% Total % Received % Xferd Average Speed Time Time Time Current
Dload Upload Total Spent Left Speed
0 0 0 0 0 0 0 0 --:--:-- --:--:-- --:--:-- 0 100 180 0 2 100 178 7 657 --:--:-- --:--:-- --:--:-- 659
okERROR: Job failed: exit status 1
failed
ubuntu_build Build
make[1]: Entering directory '/home/gitlab-runner/builds/29d290dc/0/openfpm/openfpm_data/openfpm_data/build'
make[1]: *** No targets specified and no makefile found. Stop.
make[1]: Leaving directory '/home/gitlab-runner/builds/29d290dc/0/openfpm/openfpm_data/openfpm_data/build'
Makefile:5: recipe for target 'build' failed
make: *** [build] Error 2
% Total % Received % Xferd Average Speed Time Time Time Current
Dload Upload Total Spent Left Speed
0 0 0 0 0 0 0 0 --:--:-- --:--:-- --:--:-- 0 100 180 0 2 100 178 7 629 --:--:-- --:--:-- --:--:-- 631
okERROR: Job failed: exit status 1