Adding libhilbert installation

6 jobs for GPU_test in 7 seconds (queued for 2 seconds)
Status Job ID Name Coverage
  Build
failed #1137
centos
centos_build

00:00:03

failed #1138
mac
mac_build

00:00:03

failed #1139
ubuntu
ubuntu_build

00:00:02

 
  Test
skipped #1140
centos
centos_run
skipped #1141
mac
mac_run
skipped #1142
ubuntu
ubuntu_run
 
Name Stage Failure
failed
mac_build Build
-- Configuring incomplete, errors occurred!
See also "/Users/jenkins/builds/220b7aaa/0/openfpm/openfpm_data/openfpm_data/build/CMakeFiles/CMakeOutput.log".
/Library/Developer/CommandLineTools/usr/bin/make -C build
make[1]: *** No targets specified and no makefile found. Stop.
make: *** [build] Error 2
% Total % Received % Xferd Average Speed Time Time Time Current
Dload Upload Total Spent Left Speed
0 0 0 0 0 0 0 0 --:--:-- --:--:-- --:--:-- 0 100 175 0 2 100 173 10 906 --:--:-- --:--:-- --:--:-- 910
ok
ERROR: Job failed: exit status 1
failed
centos_build Build
make -C build
make[1]: Entering directory `/home/gitlab-runner/builds/80f82b32/0/openfpm/openfpm_data/openfpm_data/build'
make[1]: *** No targets specified and no makefile found. Stop.
make[1]: Leaving directory `/home/gitlab-runner/builds/80f82b32/0/openfpm/openfpm_data/openfpm_data/build'
make: *** [build] Error 2
% Total % Received % Xferd Average Speed Time Time Time Current
Dload Upload Total Spent Left Speed
0 0 0 0 0 0 0 0 --:--:-- --:--:-- --:--:-- 0 100 175 0 2 100 173 7 624 --:--:-- --:--:-- --:--:-- 626
ok
ERROR: Job failed: exit status 1
failed
ubuntu_build Build
make[1]: Entering directory '/home/gitlab-runner/builds/29d290dc/0/openfpm/openfpm_data/openfpm_data/build'
make[1]: *** No targets specified and no makefile found. Stop.
make[1]: Leaving directory '/home/gitlab-runner/builds/29d290dc/0/openfpm/openfpm_data/openfpm_data/build'
Makefile:5: recipe for target 'build' failed
make: *** [build] Error 2
% Total % Received % Xferd Average Speed Time Time Time Current
Dload Upload Total Spent Left Speed
0 0 0 0 0 0 0 0 --:--:-- --:--:-- --:--:-- 0 100 175 0 2 100 173 7 614 --:--:-- --:--:-- --:--:-- 615
ok
ERROR: Job failed: exit status 1