Fixing HIP compilation

4 jobs for hip_conversion in 1 minute and 29 seconds (queued for 2 seconds)
latest
Status Job ID Name Coverage
  Build
failed #5377
centos
centos_build

00:01:28

failed #5378
ubuntu
ubuntu_build

00:00:19

 
  Test
skipped #5379
centos
centos_run
skipped #5380
ubuntu
ubuntu_run
 
Name Stage Failure
failed
centos_build Build
make[2]: *** [openfpm_data/src/CMakeFiles/mem_map.dir/all] Error 2
make[2]: Leaving directory `/home/gitlab-runner/builds/80f82b32/0/openfpm/openfpm_pdata/build'
make[1]: *** [all] Error 2
make[1]: Leaving directory `/home/gitlab-runner/builds/80f82b32/0/openfpm/openfpm_pdata/build'
make: *** [all] Error 2
% Total % Received % Xferd Average Speed Time Time Time Current
Dload Upload Total Spent Left Speed
0 0 0 0 0 0 0 0 --:--:-- --:--:-- --:--:-- 0 0 0 0 0 0 0 0 0 --:--:-- --:--:-- --:--:-- 0 100 215 0 13 100 202 33 514 --:--:-- --:--:-- --:--:-- 513
invalid_token
ERROR: Job failed: exit status 1
failed
ubuntu_build Build
Makefile:140: recipe for target 'all' failed
make[1]: *** [all] Error 2
make[1]: Leaving directory '/home/gitlab-runner/builds/3ab189aa/0/openfpm/openfpm_pdata/build'
Makefile:2: recipe for target 'all' failed
make: *** [all] Error 2
% Total % Received % Xferd Average Speed Time Time Time Current
Dload Upload Total Spent Left Speed
0 0 0 0 0 0 0 0 --:--:-- --:--:-- --:--:-- 0 100 204 0 13 100 191 36 534 --:--:-- --:--:-- --:--:-- 535
invalid_token
ERROR: Job failed: exit status 1