Adding Box to nm_v

6 jobs for refactor_dd in 5 minutes and 46 seconds
latest
Status Job ID Name Coverage
  Build
failed #8539
centos
centos_build

00:04:17

failed #8540
mac
mac_build

00:05:44

failed #8541
ubuntu
ubuntu_build

00:03:16

 
  Test
skipped #8542
centos
centos_run
skipped #8543
mac
mac_run
skipped #8544
ubuntu
ubuntu_run
 
Name Stage Failure
failed
mac_build Build
[ 91%] Building CXX object openfpm_numerics/src/CMakeFiles/numerics.dir/__/__/openfpm_devices/src/memory/PtrMemory.cpp.o
cd /Users/jenkins/builds/220b7aaa/0/openfpm/openfpm_pdata/build/openfpm_numerics/src && /Users/jenkins/openfpm_dependencies/openfpm_pdata/refactor_dd/MPI/bin/mpic++ -I/Users/jenkins/builds/220b7aaa/0/openfpm/openfpm_pdata/openfpm_numerics/src -I/Users/jenkins/builds/220b7aaa/0/openfpm/openfpm_pdata/openfpm_numerics/src/../../openfpm_devices/src -I/Users/jenkins/builds/220b7aaa/0/openfpm/openfpm_pdata/openfpm_numerics/src/../../openfpm_vcluster/src -I/Users/jenkins/builds/220b7aaa/0/openfpm/openfpm_pdata/openfpm_numerics/src/../../src -I/Users/jenkins/builds/220b7aaa/0/openfpm/openfpm_pdata/openfpm_numerics/src/../../openfpm_data/src -I/Users/jenkins/builds/220b7aaa/0/openfpm/openfpm_pdata/openfpm_numerics/src/../../openfpm_io/src -I/Users/jenkins/builds/220b7aaa/0/openfpm/openfpm_pdata/openfpm_numerics/src/config -I/Users/jenkins/openfpm_dependencies/openfpm_pdata/refactor_dd/PARMETIS/include -I/Users/jenkins/openfpm_dependencies/openfpm_pdata/refactor_dd/METIS/include -I/Users/jenkins/openfpm_dependencies/openfpm_pdata/refactor_dd/HDF5/include -I/Users/jenkins/openfpm_dependencies/openfpm_pdata/refactor_dd/LIBHILBERT/include -I/Users/jenkins/openfpm_dependencies/openfpm_pdata/refactor_dd/BOOST/include -I/Users/jenkins/openfpm_dependencies/openfpm_pdata/refactor_dd/VCDEVEL/include -I/Users/jenkins/openfpm_dependencies/openfpm_pdata/refactor_dd/EIGEN -I/Users/jenkins/openfpm_dependencies/openfpm_pdata/refactor_dd/PETSC/include -I/Users/jenkins/openfpm_dependencies/openfpm_pdata/refactor_dd/MPI/include -I/Users/jenkins/openfpm_dependencies/openfpm_pdata/refactor_dd/SUITESPARSE/include -O3 -std=gnu++11 -o CMakeFiles/numerics.dir/__/__/openfpm_devices/src/memory/PtrMemory.cpp.o -c /Users/jenkins/builds/220b7aaa/0/openfpm/openfpm_pdata/openfpm_devices/src/memory/PtrMemory.cpp
[ 91%] Building CXX object openfpm_numerics/src/CMakeFiles/numerics.dir/__/__/openfpm_devices/src/Memleak_check.cpp.o
cd /Users/jenkins/builds/220b7aaa/0/openfpm/openfpm_pdata/build/openfpm_numerics/src && /Users/jenkins/openfpm_dependencies/openfpm_pdata/refactor_dd/MPI/bin/mpic++ -I/Users/jenkins/builds/220b7aaa/0/openfpm/openfpm_pdata/openfpm_numerics/src -I/Users/jenkins/builds/220b7aaa/0/openfpm/openfpm_pdata/openfpm_numerics/src/../../openfpm_devices/src -I/Users/jenkins/builds/220b7aaa/0/openfpm/openfpm_pdata/openfpm_numerics/src/../../openfpm_vcluster/src -I/Users/jenkins/builds/220b7aaa/0/openfpm/openfpm_pdata/openfpm_numerics/src/../../src -I/Users/jenkins/builds/220b7aaa/0/openfpm/openfpm_pdata/openfpm_numerics/src/../../openfpm_data/src -I/Users/jenkins/builds/220b7aaa/0/openfpm/openfpm_pdata/openfpm_numerics/src/../../openfpm_io/src -I/Users/jenkins/builds/220b7aaa/0/openfpm/openfpm_pdata/openfpm_numerics/src/config -I/Users/jenkins/openfpm_dependencies/openfpm_pdata/refactor_dd/PARMETIS/include -I/Users/jenkins/openfpm_dependencies/openfpm_pdata/refactor_dd/METIS/include -I/Users/jenkins/openfpm_dependencies/openfpm_pdata/refactor_dd/HDF5/include -I/Users/jenkins/openfpm_dependencies/openfpm_pdata/refactor_dd/LIBHILBERT/include -I/Users/jenkins/openfpm_dependencies/openfpm_pdata/refactor_dd/BOOST/include -I/Users/jenkins/openfpm_dependencies/openfpm_pdata/refactor_dd/VCDEVEL/include -I/Users/jenkins/openfpm_dependencies/openfpm_pdata/refactor_dd/EIGEN -I/Users/jenkins/openfpm_dependencies/openfpm_pdata/refactor_dd/PETSC/include -I/Users/jenkins/openfpm_dependencies/openfpm_pdata/refactor_dd/MPI/include -I/Users/jenkins/openfpm_dependencies/openfpm_pdata/refactor_dd/SUITESPARSE/include -O3 -std=gnu++11 -o CMakeFiles/numerics.dir/__/__/openfpm_devices/src/Memleak_check.cpp.o -c /Users/jenkins/builds/220b7aaa/0/openfpm/openfpm_pdata/openfpm_devices/src/Memleak_check.cpp
[ 92%] Building CXX object openfpm_numerics/src/CMakeFiles/numerics.dir/__/__/src/lib/pdata.cpp.o
cd /Users/jenkins/builds/220b7aaa/0/openfpm/openfpm_pdata/build/openfpm_numerics/src && /Users/jenkins/openfpm_dependencies/openfpm_pdata/refactor_dd/MPI/bin/mpic++ -I/Users/jenkins/builds/220b7aaa/0/openfpm/openfpm_pdata/openfpm_numerics/src -I/Users/jenkins/builds/220b7aaa/0/openfpm/openfpm_pdata/openfpm_numerics/src/../../openfpm_devices/src -I/Users/jenkins/builds/220b7aaa/0/openfpm/openfpm_pdata/openfpm_numerics/src/../../openfpm_vcluster/src -I/Users/jenkins/builds/220b7aaa/0/openfpm/openfpm_pdata/openfpm_numerics/src/../../src -I/Users/jenkins/builds/220b7aaa/0/openfpm/openfpm_pdata/openfpm_numerics/src/../../openfpm_data/src -I/Users/jenkins/builds/220b7aaa/0/openfpm/openfpm_pdata/openfpm_numerics/src/../../openfpm_io/src -I/Users/jenkins/builds/220b7aaa/0/openfpm/openfpm_pdata/openfpm_numerics/src/config -I/Users/jenkins/openfpm_dependencies/openfpm_pdata/refactor_dd/PARMETIS/include -I/Users/jenkins/openfpm_dependencies/openfpm_pdata/refactor_dd/METIS/include -I/Users/jenkins/openfpm_dependencies/openfpm_pdata/refactor_dd/HDF5/include -I/Users/jenkins/openfpm_dependencies/openfpm_pdata/refactor_dd/LIBHILBERT/include -I/Users/jenkins/openfpm_dependencies/openfpm_pdata/refactor_dd/BOOST/include -I/Users/jenkins/openfpm_dependencies/openfpm_pdata/refactor_dd/VCDEVEL/include -I/Users/jenkins/openfpm_dependencies/openfpm_pdata/refactor_dd/EIGEN -I/Users/jenkins/openfpm_dependencies/openfpm_pdata/refactor_dd/PETSC/include -I/Users/jenkins/openfpm_dependencies/openfpm_pdata/refactor_dd/MPI/include -I/Users/jenkins/openfpm_dependencies/openfpm_pdata/refactor_dd/SUITESPARSE/include -O3 -std=gnu++11 -o CMakeFiles/numerics.dir/__/__/src/lib/pdata.cpp.o -c /Users/jenkins/builds/220b7aaa/0/openfpm/openfpm_pdata/src/lib/pdata.cpp
[ 93%] Linking CXX executable numerics
cd /Users/jenkins/builds/220b7aaa/0/openfpm/openfpm_pdata/build/openfpm_numerics/src && /Applications/CMake.app/Contents/bin/cmake -E cmake_link_script CMakeFiles/numerics.dir/link.txt --verbose=1
/Users/jenkins/openfpm_dependencies/openfpm_pdata/refactor_dd/MPI/bin/mpic++ -O3 -Wl,-search_paths_first -Wl,-headerpad_max_install_names CMakeFiles/numerics.dir/initialize/initialize_wrapper_cpu.cpp.o CMakeFiles/numerics.dir/main.cpp.o CMakeFiles/numerics.dir/Matrix/SparseMatrix_unit_tests.cpp.o CMakeFiles/numerics.dir/interpolation/interpolation_unit_tests.cpp.o CMakeFiles/numerics.dir/Vector/Vector_unit_tests.cpp.o CMakeFiles/numerics.dir/Solvers/petsc_solver_unit_tests.cpp.o CMakeFiles/numerics.dir/FiniteDifference/FDScheme_unit_tests.cpp.o CMakeFiles/numerics.dir/FiniteDifference/eq_unit_test_3d.cpp.o CMakeFiles/numerics.dir/FiniteDifference/eq_unit_test.cpp.o CMakeFiles/numerics.dir/Operators/Vector/vector_dist_operators_unit_tests.cpp.o CMakeFiles/numerics.dir/Operators/Vector/vector_dist_operators_apply_kernel_unit_tests.cpp.o CMakeFiles/numerics.dir/__/__/openfpm_vcluster/src/VCluster/VCluster.cpp.o CMakeFiles/numerics.dir/__/__/openfpm_devices/src/memory/HeapMemory.cpp.o CMakeFiles/numerics.dir/__/__/openfpm_devices/src/memory/PtrMemory.cpp.o CMakeFiles/numerics.dir/__/__/openfpm_devices/src/Memleak_check.cpp.o CMakeFiles/numerics.dir/__/__/src/lib/pdata.cpp.o -o numerics -Wl,-rpath,/Users/jenkins/openfpm_dependencies/openfpm_pdata/refactor_dd/PETSC/lib /Users/jenkins/openfpm_dependencies/openfpm_pdata/refactor_dd/BOOST/lib/libboost_unit_test_framework.dylib /Users/jenkins/openfpm_dependencies/openfpm_pdata/refactor_dd/BOOST/lib/libboost_iostreams.dylib /Users/jenkins/openfpm_dependencies/openfpm_pdata/refactor_dd/BOOST/lib/libboost_program_options.dylib /Users/jenkins/openfpm_dependencies/openfpm_pdata/refactor_dd/BOOST/lib/libboost_regex.dylib /Users/jenkins/openfpm_dependencies/openfpm_pdata/refactor_dd/HDF5/lib/libhdf5.dylib /Users/jenkins/openfpm_dependencies/openfpm_pdata/refactor_dd/ZLIB/lib/libz.dylib /usr/lib/libdl.dylib /usr/lib/libm.dylib /Users/jenkins/openfpm_dependencies/openfpm_pdata/refactor_dd/PARMETIS/lib/libparmetis.a /Users/jenkins/openfpm_dependencies/openfpm_pdata/refactor_dd/METIS/lib/libmetis.dylib /Users/jenkins/openfpm_dependencies/openfpm_pdata/refactor_dd/METIS/lib/libmetis.dylib -L/Users/jenkins/openfpm_dependencies/openfpm_pdata/refactor_dd/LIBHILBERT/lib -llibhilbert /Users/jenkins/openfpm_dependencies/openfpm_pdata/refactor_dd/VCDEVEL/lib/libVc.a /Users/jenkins/openfpm_dependencies/openfpm_pdata/refactor_dd/PETSC/lib/libpetsc.dylib /Users/jenkins/openfpm_dependencies/openfpm_pdata/refactor_dd/PETSC/lib/libHYPRE.dylib /Users/jenkins/openfpm_dependencies/openfpm_pdata/refactor_dd/PETSC/lib/libcmumps.a /Users/jenkins/openfpm_dependencies/openfpm_pdata/refactor_dd/PETSC/lib/libdmumps.a /Users/jenkins/openfpm_dependencies/openfpm_pdata/refactor_dd/PETSC/lib/libsmumps.a /Users/jenkins/openfpm_dependencies/openfpm_pdata/refactor_dd/PETSC/lib/libzmumps.a /Users/jenkins/openfpm_dependencies/openfpm_pdata/refactor_dd/PETSC/lib/libmumps_common.a /Users/jenkins/openfpm_dependencies/openfpm_pdata/refactor_dd/PETSC/lib/libpord.a /Users/jenkins/openfpm_dependencies/openfpm_pdata/refactor_dd/PETSC/lib/libscalapack.a /Users/jenkins/openfpm_dependencies/openfpm_pdata/refactor_dd/PETSC/lib/libsuperlu_dist.dylib /Users/jenkins/openfpm_dependencies/openfpm_pdata/refactor_dd/OPENBLAS/lib/libopenblas.dylib /Users/jenkins/openfpm_dependencies/openfpm_pdata/refactor_dd/PETSC/lib/libparmetis.dylib /Users/jenkins/openfpm_dependencies/openfpm_pdata/refactor_dd/PETSC/lib/libmetis.dylib /Users/jenkins/openfpm_dependencies/openfpm_pdata/refactor_dd/MPI/lib/libmpi_usempif08.dylib /Users/jenkins/openfpm_dependencies/openfpm_pdata/refactor_dd/MPI/lib/libmpi_usempi_ignore_tkr.a /Users/jenkins/openfpm_dependencies/openfpm_pdata/refactor_dd/MPI/lib/libmpi_mpifh.dylib /Users/jenkins/openfpm_dependencies/openfpm_pdata/refactor_dd/MPI/lib/libmpi.dylib /usr/local/Cellar/gcc/8.2.0/lib/gcc/8/libgfortran.dylib /usr/local/Cellar/gcc/8.2.0/lib/gcc/8/libquadmath.dylib /usr/lib/libm.dylib /usr/lib/libc++.dylib /usr/lib/libdl.dylib /Users/jenkins/openfpm_dependencies/openfpm_pdata/refactor_dd/SUITESPARSE/lib/libumfpack.dylib /Users/jenkins/openfpm_dependencies/openfpm_pdata/refactor_dd/SUITESPARSE/lib/libcholmod.dylib /Users/jenkins/openfpm_dependencies/openfpm_pdata/refactor_dd/SUITESPARSE/lib/libamd.dylib /Users/jenkins/openfpm_dependencies/openfpm_pdata/refactor_dd/SUITESPARSE/lib/libcamd.dylib /Users/jenkins/openfpm_dependencies/openfpm_pdata/refactor_dd/SUITESPARSE/lib/libcolamd.dylib /Users/jenkins/openfpm_dependencies/openfpm_pdata/refactor_dd/SUITESPARSE/lib/libccolamd.dylib /Users/jenkins/openfpm_dependencies/openfpm_pdata/refactor_dd/SUITESPARSE/lib/libsuitesparseconfig.dylib /Users/jenkins/openfpm_dependencies/openfpm_pdata/refactor_dd/OPENBLAS/lib/libopenblas.dylib -L/Users/jenkins/openfpm_dependencies/openfpm_pdata/refactor_dd/METIS/lib -lmetis /Users/jenkins/openfpm_dependencies/openfpm_pdata/refactor_dd/MPI/lib/libmpi.dylib /usr/lib/libdl.dylib /usr/lib/libm.dylib /Users/jenkins/openfpm_dependencies/openfpm_pdata/refactor_dd/PARMETIS/lib/libparmetis.a /Users/jenkins/openfpm_dependencies/openfpm_pdata/refactor_dd/METIS/lib/libmetis.dylib -llibhilbert /Users/jenkins/openfpm_dependencies/openfpm_pdata/refactor_dd/VCDEVEL/lib/libVc.a /Users/jenkins/openfpm_dependencies/openfpm_pdata/refactor_dd/PETSC/lib/libpetsc.dylib /Users/jenkins/openfpm_dependencies/openfpm_pdata/refactor_dd/PETSC/lib/libHYPRE.dylib /Users/jenkins/openfpm_dependencies/openfpm_pdata/refactor_dd/PETSC/lib/libcmumps.a /Users/jenkins/openfpm_dependencies/openfpm_pdata/refactor_dd/PETSC/lib/libdmumps.a /Users/jenkins/openfpm_dependencies/openfpm_pdata/refactor_dd/PETSC/lib/libsmumps.a /Users/jenkins/openfpm_dependencies/openfpm_pdata/refactor_dd/PETSC/lib/libzmumps.a /Users/jenkins/openfpm_dependencies/openfpm_pdata/refactor_dd/PETSC/lib/libmumps_common.a /Users/jenkins/openfpm_dependencies/openfpm_pdata/refactor_dd/PETSC/lib/libpord.a /Users/jenkins/openfpm_dependencies/openfpm_pdata/refactor_dd/PETSC/lib/libscalapack.a /Users/jenkins/openfpm_dependencies/openfpm_pdata/refactor_dd/PETSC/lib/libsuperlu_dist.dylib /Users/jenkins/openfpm_dependencies/openfpm_pdata/refactor_dd/OPENBLAS/lib/libopenblas.dylib /Users/jenkins/openfpm_dependencies/openfpm_pdata/refactor_dd/PETSC/lib/libparmetis.dylib /Users/jenkins/openfpm_dependencies/openfpm_pdata/refactor_dd/PETSC/lib/libmetis.dylib /Users/jenkins/openfpm_dependencies/openfpm_pdata/refactor_dd/MPI/lib/libmpi_usempif08.dylib /Users/jenkins/openfpm_dependencies/openfpm_pdata/refactor_dd/MPI/lib/libmpi_usempi_ignore_tkr.a /Users/jenkins/openfpm_dependencies/openfpm_pdata/refactor_dd/MPI/lib/libmpi_mpifh.dylib /usr/local/Cellar/gcc/8.2.0/lib/gcc/8/libgfortran.dylib /usr/local/Cellar/gcc/8.2.0/lib/gcc/8/libquadmath.dylib /usr/lib/libc++.dylib /Users/jenkins/openfpm_dependencies/openfpm_pdata/refactor_dd/SUITESPARSE/lib/libumfpack.dylib /Users/jenkins/openfpm_dependencies/openfpm_pdata/refactor_dd/SUITESPARSE/lib/libcholmod.dylib /Users/jenkins/openfpm_dependencies/openfpm_pdata/refactor_dd/SUITESPARSE/lib/libamd.dylib /Users/jenkins/openfpm_dependencies/openfpm_pdata/refactor_dd/SUITESPARSE/lib/libcamd.dylib /Users/jenkins/openfpm_dependencies/openfpm_pdata/refactor_dd/SUITESPARSE/lib/libcolamd.dylib /Users/jenkins/openfpm_dependencies/openfpm_pdata/refactor_dd/SUITESPARSE/lib/libccolamd.dylib /Users/jenkins/openfpm_dependencies/openfpm_pdata/refactor_dd/SUITESPARSE/lib/libsuitesparseconfig.dylib -lmetis
[ 93%] Built target numerics
failed
centos_build Build
[ 93%] Built target numerics
make[3]: Leaving directory `/home/gitlab-runner/builds/80f82b32/0/openfpm/openfpm_pdata/build'
make[2]: *** [src/CMakeFiles/pdata.dir/all] Error 2
make[2]: Leaving directory `/home/gitlab-runner/builds/80f82b32/0/openfpm/openfpm_pdata/build'
make[1]: *** [all] Error 2
make[1]: Leaving directory `/home/gitlab-runner/builds/80f82b32/0/openfpm/openfpm_pdata/build'
make: *** [all] Error 2
Fail make install
ERROR: Job failed: exit status 1
failed
ubuntu_build Build
make[2]: *** [src/CMakeFiles/pdata.dir/all] Error 2
make[2]: Leaving directory '/home/gitlab-runner/builds/3ab189aa/0/openfpm/openfpm_pdata/build'
Makefile:140: recipe for target 'all' failed
make[1]: *** [all] Error 2
make[1]: Leaving directory '/home/gitlab-runner/builds/3ab189aa/0/openfpm/openfpm_pdata/build'
Makefile:2: recipe for target 'all' failed
make: *** [all] Error 2
Fail make install
ERROR: Job failed: exit status 1