Removing garbage

6 jobs for master in 16 seconds (queued for 1 second)
Status Job ID Name Coverage
  Build
failed #6628
centos
centos_build

00:00:10

failed #6629
mac
mac_build

00:00:14

failed #6630
ubuntu
ubuntu_build

00:00:08

 
  Test
skipped #6631
centos
centos_run
skipped #6632
mac
mac_run
skipped #6633
ubuntu
ubuntu_run
 
Name Stage Failure
failed
mac_build Build
/Users/jenkins/builds/220b7aaa/0/openfpm/openfpm_vcluster/openfpm_vcluster/src/../../openfpm_data/src/memory_ly/memory_array.hpp:12:10: fatal error: 'Memleak_check.hpp' file not found
#include "Memleak_check.hpp"
^~~~~~~~~~~~~~~~~~~
1 error generated.
make[3]: *** [src/CMakeFiles/vcluster_test.dir/main.cpp.o] Error 1
make[2]: *** [src/CMakeFiles/vcluster_test.dir/all] Error 2
make[1]: *** [all] Error 2
make: *** [all] Error 2
ERROR: Job failed: exit status 1
failed
ubuntu_build Build
CMakeFiles/Makefile2:89: recipe for target 'src/CMakeFiles/vcluster_test.dir/all' failed
make[2]: *** [src/CMakeFiles/vcluster_test.dir/all] Error 2
make[2]: Leaving directory '/home/gitlab-runner/builds/3ab189aa/0/openfpm/openfpm_vcluster/openfpm_vcluster/build'
Makefile:129: recipe for target 'all' failed
make[1]: *** [all] Error 2
make[1]: Leaving directory '/home/gitlab-runner/builds/3ab189aa/0/openfpm/openfpm_vcluster/openfpm_vcluster/build'
Makefile:2: recipe for target 'all' failed
make: *** [all] Error 2
ERROR: Job failed: exit status 1
failed
centos_build Build
make[2]: *** [src/CMakeFiles/vcluster_dl.dir/all] Error 2
make[3]: *** [src/CMakeFiles/vcluster_test.dir/main.cpp.o] Error 1
make[3]: Leaving directory `/home/gitlab-runner/builds/80f82b32/0/openfpm/openfpm_vcluster/openfpm_vcluster/build'
make[2]: *** [src/CMakeFiles/vcluster_test.dir/all] Error 2
make[2]: Leaving directory `/home/gitlab-runner/builds/80f82b32/0/openfpm/openfpm_vcluster/openfpm_vcluster/build'
make[1]: *** [all] Error 2
make[1]: Leaving directory `/home/gitlab-runner/builds/80f82b32/0/openfpm/openfpm_vcluster/openfpm_vcluster/build'
make: *** [all] Error 2
ERROR: Job failed: exit status 1