Windows native conversion

6 jobs for msys2_conversion in 2 minutes and 50 seconds (queued for 4 minutes and 38 seconds)
latest
Status Job ID Name Coverage
  Build
failed #11525
centos
centos_build

00:00:19

failed #11526
mac
mac_build

00:01:07

failed #11527
ubuntu
ubuntu_build

00:01:23

 
  Test
skipped #11528
centos
centos_run
skipped #11529
mac
mac_run
skipped #11530
ubuntu
ubuntu_run
 
Name Stage Failure
failed
centos_build Build
                  ^~~~~~~~~~~~~~~~~~~~~~~~~~~~~~~~~~
make[3]: *** [src/CMakeFiles/vcluster_test.dir/build.make:89: src/CMakeFiles/vcluster_test.dir/VCluster/VCluster_unit_tests.cpp.o] Error 1
make[3]: Leaving directory '/home/gitlab-runner/builds/80f82b32/0/openfpm/openfpm_vcluster/openfpm_vcluster/build'
make[2]: *** [CMakeFiles/Makefile2:391: src/CMakeFiles/vcluster_test.dir/all] Error 2
make[2]: Leaving directory '/home/gitlab-runner/builds/80f82b32/0/openfpm/openfpm_vcluster/openfpm_vcluster/build'
make[1]: *** [Makefile:130: all] Error 2
make[1]: Leaving directory '/home/gitlab-runner/builds/80f82b32/0/openfpm/openfpm_vcluster/openfpm_vcluster/build'
make: *** [Makefile:2: all] Error 2
ERROR: Job failed: exit status 1
failed
ubuntu_build Build
make[3]: Leaving directory '/home/gitlab-runner/builds/3ab189aa/0/openfpm/openfpm_vcluster/openfpm_vcluster/build'
[ 84%] Built target mem_map
make[2]: Leaving directory '/home/gitlab-runner/builds/3ab189aa/0/openfpm/openfpm_vcluster/openfpm_vcluster/build'
Makefile:148: recipe for target 'all' failed
make[1]: *** [all] Error 2
make[1]: Leaving directory '/home/gitlab-runner/builds/3ab189aa/0/openfpm/openfpm_vcluster/openfpm_vcluster/build'
Makefile:2: recipe for target 'all' failed
make: *** [all] Error 2
ERROR: Job failed: exit status 1
failed
mac_build Build
[ 86%] Building CXX object openfpm_data/src/CMakeFiles/mem_map.dir/Grid/Geometry/tests/grid_smb_tests.cpp.o
cd /Users/jenkins/builds/220b7aaa/0/openfpm/openfpm_vcluster/openfpm_vcluster/build/openfpm_data/src && /Users/jenkins/openfpm_dependencies/openfpm_vcluster/MPI/bin/mpic++ -DSCAN_WITH_CUB -I/Users/jenkins/builds/220b7aaa/0/openfpm/openfpm_vcluster/openfpm_data/src -I/Users/jenkins/builds/220b7aaa/0/openfpm/openfpm_vcluster/openfpm_data/src/../../openfpm_devices/src -I/Users/jenkins/builds/220b7aaa/0/openfpm/openfpm_vcluster/openfpm_data/src/config -I/Users/jenkins/openfpm_dependencies/openfpm_vcluster/LIBHILBERT/include -I/Users/jenkins/openfpm_dependencies/openfpm_vcluster/BOOST/include -I/include -I/Users/jenkins/openfpm_dependencies/openfpm_vcluster/VCDEVEL/include -O3 -DNDEBUG -std=gnu++14 -o CMakeFiles/mem_map.dir/Grid/Geometry/tests/grid_smb_tests.cpp.o -c /Users/jenkins/builds/220b7aaa/0/openfpm/openfpm_vcluster/openfpm_data/src/Grid/Geometry/tests/grid_smb_tests.cpp
[ 88%] Linking CXX executable mem_map
cd /Users/jenkins/builds/220b7aaa/0/openfpm/openfpm_vcluster/openfpm_vcluster/build/openfpm_data/src && /Applications/CMake.app/Contents/bin/cmake -E cmake_link_script CMakeFiles/mem_map.dir/link.txt --verbose=1
/Users/jenkins/openfpm_dependencies/openfpm_vcluster/MPI/bin/mpic++ -O3 -DNDEBUG -Wl,-search_paths_first -Wl,-headerpad_max_install_names CMakeFiles/mem_map.dir/main.cpp.o CMakeFiles/mem_map.dir/data_type/aggregate_unit_tests.cpp.o CMakeFiles/mem_map.dir/util/multi_array_openfpm/multi_array_ref_openfpm_unit_test.cpp.o CMakeFiles/mem_map.dir/memory_ly/memory_conf_unit_tests.cpp.o CMakeFiles/mem_map.dir/Space/tests/SpaceBox_unit_tests.cpp.o CMakeFiles/mem_map.dir/Space/Shape/Sphere_unit_test.cpp.o CMakeFiles/mem_map.dir/SparseGrid/SparseGrid_unit_tests.cpp.o CMakeFiles/mem_map.dir/SparseGrid/SparseGrid_chunk_copy_unit_tests.cpp.o CMakeFiles/mem_map.dir/Grid/copy_grid_unit_test.cpp.o CMakeFiles/mem_map.dir/NN/Mem_type/Mem_type_unit_tests.cpp.o CMakeFiles/mem_map.dir/Grid/Geometry/tests/grid_smb_tests.cpp.o -o mem_map /Users/jenkins/openfpm_dependencies/openfpm_vcluster/BOOST/lib/libboost_unit_test_framework.dylib /Users/jenkins/openfpm_dependencies/openfpm_vcluster/BOOST/lib/libboost_iostreams.dylib /Users/jenkins/openfpm_dependencies/openfpm_vcluster/BOOST/lib/libboost_program_options.dylib /Users/jenkins/openfpm_dependencies/openfpm_vcluster/BOOST/lib/libboost_system.dylib /Users/jenkins/openfpm_dependencies/openfpm_vcluster/BOOST/lib/libboost_filesystem.dylib /Users/jenkins/openfpm_dependencies/openfpm_vcluster/BOOST/lib/libboost_regex.dylib /Users/jenkins/openfpm_dependencies/openfpm_vcluster/BOOST/lib/libboost_thread.dylib /Users/jenkins/openfpm_dependencies/openfpm_vcluster/BOOST/lib/libboost_chrono.dylib /Users/jenkins/openfpm_dependencies/openfpm_vcluster/BOOST/lib/libboost_date_time.dylib /Users/jenkins/openfpm_dependencies/openfpm_vcluster/BOOST/lib/libboost_atomic.dylib -L/Users/jenkins/openfpm_dependencies/openfpm_vcluster/LIBHILBERT/lib -llibhilbert ../openfpm_devices/src/libofpmmemory.a /Users/jenkins/openfpm_dependencies/openfpm_vcluster/VCDEVEL/lib/libVc.a /Users/jenkins/openfpm_dependencies/openfpm_vcluster/MPI/lib/libmpi.dylib -lm /Users/jenkins/openfpm_dependencies/openfpm_vcluster/BOOST/lib/libboost_unit_test_framework.dylib /Users/jenkins/openfpm_dependencies/openfpm_vcluster/BOOST/lib/libboost_iostreams.dylib /Users/jenkins/openfpm_dependencies/openfpm_vcluster/BOOST/lib/libboost_program_options.dylib /Users/jenkins/openfpm_dependencies/openfpm_vcluster/BOOST/lib/libboost_system.dylib /Users/jenkins/openfpm_dependencies/openfpm_vcluster/BOOST/lib/libboost_regex.dylib /Users/jenkins/openfpm_dependencies/openfpm_vcluster/BOOST/lib/libboost_thread.dylib /Users/jenkins/openfpm_dependencies/openfpm_vcluster/BOOST/lib/libboost_chrono.dylib /Users/jenkins/openfpm_dependencies/openfpm_vcluster/BOOST/lib/libboost_date_time.dylib /Users/jenkins/openfpm_dependencies/openfpm_vcluster/BOOST/lib/libboost_atomic.dylib
[ 88%] Built target mem_map
make[1]: *** [all] Error 2
make: *** [all] Error 2
ERROR: Job failed: exit status 1