Adding Gitlab pipeline

7 jobs for GPU_test_new in 16 seconds (queued for 2 seconds)
Status Job ID Name Coverage
  Build
canceled #2455
centos
centos_build

failed #2450
mac
mac_build

00:00:15

failed #2451
ubuntu
ubuntu_build

00:00:16

canceled #2449
centos
centos_build

 
  Test
skipped #2452
centos
centos_run
skipped #2453
mac
mac_run
skipped #2454
ubuntu
ubuntu_run
 
Name Stage Failure
failed
mac_build Build
checking whether we are using the GNU C++ compiler... no
checking whether mpic++ accepts -g... no
checking dependency style of mpic++... none
checking how to run the C++ preprocessor... /lib/cpp
configure: error: in `/Users/jenkins/builds/220b7aaa/0/openfpm/openfpm_vcluster/openfpm_vcluster':
configure: error: C++ preprocessor "/lib/cpp" fails sanity check
See `config.log' for more details
make: *** No targets specified and no makefile found. Stop.
ERROR: Job failed: exit status 1
failed
ubuntu_build Build
In file included from VCluster/VCluster.cpp:3:0:
VCluster/VCluster.hpp:15:38: fatal error: util/math_util_complex.hpp: No such file or directory
compilation terminated.
Makefile:570: recipe for target 'VCluster/libvcluster_a-VCluster.o' failed
make[1]: *** [VCluster/libvcluster_a-VCluster.o] Error 1
make[1]: Leaving directory '/home/gitlab-runner/builds/3ab189aa/0/openfpm/openfpm_vcluster/openfpm_vcluster/src'
Makefile:477: recipe for target 'all-recursive' failed
make: *** [all-recursive] Error 1
ERROR: Job failed: exit status 1