Add MPI bin PATH

6 jobs for GPU_test_new in 10 seconds
Status Job ID Name Coverage
  Build
failed #2481
centos
centos_build

failed #2482
mac
mac_build

00:00:10

failed #2483
ubuntu
ubuntu_build

00:00:06

 
  Test
skipped #2484
centos
centos_run
skipped #2485
mac
mac_run
skipped #2486
ubuntu
ubuntu_run
 
Name Stage Failure
failed
centos_build Build There has been a timeout failure or the job got stuck. Check your timeout limits or try again
No job log
failed
mac_build Build
                                               openfpm::vector_fr<BMemory<HeapMemory>> & recv_buf,
~~~~~~~~~^
fatal error: too many errors emitted, stopping now [-ferror-limit=]
20 errors generated.
make[3]: *** [src/CMakeFiles/vcluster.dir/VCluster/VCluster.cpp.o] Error 1
make[2]: *** [src/CMakeFiles/vcluster.dir/all] Error 2
make[1]: *** [all] Error 2
make: *** [all] Error 2
ERROR: Job failed: exit status 1
failed
ubuntu_build Build
-- Found MPI: TRUE (found version "3.0")  
CMake Error at CMakeLists.txt:59 (message):
BOOST is required in order to install OpenFPM


-- Configuring incomplete, errors occurred!
See also "/home/gitlab-runner/builds/3ab189aa/0/openfpm/openfpm_vcluster/openfpm_vcluster/build/CMakeFiles/CMakeOutput.log".
make: *** No targets specified and no makefile found. Stop.
ERROR: Job failed: exit status 1