fixed windows path error due to wrong slash

7 jobs for device-name-check-depends in 1 minute and 21 seconds (queued for 1 second)
Status Job ID Name Coverage
  Build
passed #875
centos
centos_build

00:00:11

passed #876
mac
mac_build

00:00:11

passed #877
ubuntu
ubuntu_build

00:00:14

passed #878
windows
win_build

00:00:35

 
  Test
failed #879
centos
centos_test

00:00:12

failed #880
mac
mac_test

00:00:11

failed #881
windows
win_test

00:00:44

 
Name Stage Failure
failed
win_test Test

67% tests passed, 1 tests failed out of 3

Total Test time (real) = 0.09 sec

The following tests FAILED:
3 - build_machine (Failed)
Errors while running CTest
ERROR: Job failed: exit status 8
failed
centos_test Test

67% tests passed, 1 tests failed out of 3

Total Test time (real) = 0.01 sec

The following tests FAILED:
3 - build_machine (Failed)
Errors while running CTest
ERROR: Job failed: exit status 1
failed
mac_test Test

67% tests passed, 1 tests failed out of 3

Total Test time (real) = 0.02 sec

The following tests FAILED:
3 - build_machine (Failed)
Errors while running CTest
ERROR: Job failed: exit status 1